Reaction Details
TargetD(1A) dopamine receptor
LigandBDBM60961
Substrate/Competitorn/a
Meas. Tech.Reception Binding Assay
Temperature303.15±n/a K
Ki 1440.62±n/a nM
IC50 2917.2±n/a nM
Commentsextracted
Citation Liu, HXie, XZhen, XSun, HLi, JZhu, LLi, ZChen, YJiang, HChen, K Hexahydrodibenzo[a,g]quinolizine compound, preparation method thereof, pharmaceutical composition and use thereof US Patent US9359372 Publication Date 6/7/2016
 
D(1A) dopamine receptor
Name:D(1A) dopamine receptor
Type:Enzyme
Mol. Mass.:49303.43
Organism:Homo sapiens (Human)
Description:P21728
Residue:446
BDBM60961
NameBDBM60961
Synonyms:US9359372, DC037018
Typen/a
Emp. Form.C21H25NO2
Mol. Mass.323.4287
SMILESCOc1cc2CCN3Cc4c(C)cc(C)cc4CC3c2cc1OC