Reaction Details
TargetD(1A) dopamine receptor
LigandBDBM235776
Substrate/Competitorn/a
Meas. Tech.Reception Binding Assay
Temperature303.15±n/a K
Ki 522.03±n/a nM
IC50 1057.1±n/a nM
Commentsextracted
Citation Liu, HXie, XZhen, XSun, HLi, JZhu, LLi, ZChen, YJiang, HChen, K Hexahydrodibenzo[a,g]quinolizine compound, preparation method thereof, pharmaceutical composition and use thereof US Patent US9359372 Publication Date 6/7/2016
 
D(1A) dopamine receptor
Name:D(1A) dopamine receptor
Type:Enzyme
Mol. Mass.:49303.43
Organism:Homo sapiens (Human)
Description:P21728
Residue:446
BDBM235776
NameBDBM235776
Synonyms:US9359372, DC037027
TypeSmall organic molecule
Emp. Form.C20H23NO5
Mol. Mass.357.4003
SMILESCOc1cc2CC3N(CCc4cc(O)c(O)cc34)Cc2c(OC)c1OC