Reaction Details
TargetD(1A) dopamine receptor
LigandBDBM235779
Substrate/Competitorn/a
Meas. Tech.Reception Binding Assay
Temperature303.15±n/a K
Ki 25.25±n/a nM
IC50 49.23±n/a nM
Commentsextracted
Citation Liu, HXie, XZhen, XSun, HLi, JZhu, LLi, ZChen, YJiang, HChen, K Hexahydrodibenzo[a,g]quinolizine compound, preparation method thereof, pharmaceutical composition and use thereof US Patent US9359372 Publication Date 6/7/2016
 
D(1A) dopamine receptor
Name:D(1A) dopamine receptor
Type:Enzyme
Mol. Mass.:49303.43
Organism:Homo sapiens (Human)
Description:P21728
Residue:446
BDBM235779
NameBDBM235779
Synonyms:US9359372, DC037032
TypeSmall organic molecule
Emp. Form.C21H23NO4
Mol. Mass.353.4116
SMILESCOc1ccc(OC)c2CN3CCc4cc5OCCOc5cc4[C@@H]3Cc12