Reaction Details
TargetD(1A) dopamine receptor
LigandBDBM235780
Substrate/Competitorn/a
Meas. Tech.Reception Binding Assay
Temperature303.15±n/a K
Ki 208.21±n/a nM
IC50 416.4±n/a nM
Commentsextracted
Citation Liu, HXie, XZhen, XSun, HLi, JZhu, LLi, ZChen, YJiang, HChen, K Hexahydrodibenzo[a,g]quinolizine compound, preparation method thereof, pharmaceutical composition and use thereof US Patent US9359372 Publication Date 6/7/2016
 
D(1A) dopamine receptor
Name:D(1A) dopamine receptor
Type:Enzyme
Mol. Mass.:49303.43
Organism:Homo sapiens (Human)
Description:P21728
Residue:446
BDBM235780
NameBDBM235780
Synonyms:US9359372, DC037033
TypeSmall organic molecule
Emp. Form.C20H21NO2
Mol. Mass.307.3862
SMILESCc1ccc(C)c2CN3CCc4cc5OCOc5cc4[C@@H]3Cc12