Reaction Details
TargetD(1A) dopamine receptor
LigandBDBM50429052
Substrate/Competitorn/a
Meas. Tech.Reception Binding Assay
Temperature303.15±n/a K
Ki 7.51±n/a nM
IC50 14.65±n/a nM
Commentsextracted
Citation Liu, HXie, XZhen, XSun, HLi, JZhu, LLi, ZChen, YJiang, HChen, K Hexahydrodibenzo[a,g]quinolizine compound, preparation method thereof, pharmaceutical composition and use thereof US Patent US9359372 Publication Date 6/7/2016
 
D(1A) dopamine receptor
Name:D(1A) dopamine receptor
Type:Enzyme
Mol. Mass.:49303.43
Organism:Homo sapiens (Human)
Description:P21728
Residue:446
BDBM50429052
NameBDBM50429052
Synonyms:CHEMBL2334881 | US9359372, DC037082
TypeSmall organic molecule
Emp. Form.C20H21NO4
Mol. Mass.339.385
SMILESCOc1c(O)ccc2C[C@@H]3N(CCc4cc5OCCOc5cc34)Cc12