Reaction Details
TargetD(2) dopamine receptor
LigandBDBM235777
Substrate/Competitorn/a
Meas. Tech.Reception Binding Assay
Temperature303.15±n/a K
Ki 485.43±n/a nM
IC50 2508.05±n/a nM
Commentsextracted
Citation Liu, HXie, XZhen, XSun, HLi, JZhu, LLi, ZChen, YJiang, HChen, K Hexahydrodibenzo[a,g]quinolizine compound, preparation method thereof, pharmaceutical composition and use thereof US Patent US9359372 Publication Date 6/7/2016
 
D(2) dopamine receptor
Name:D(2) dopamine receptor
Type:Cell-surface receptors
Mol. Mass.:50647.10
Organism:Homo sapiens (Human)
Description:P14416
Residue:443
BDBM235777
NameBDBM235777
Synonyms:US9359372, DC037013 | US9359372, DC037034
TypeSmall organic molecule
Emp. Form.C20H21NO4
Mol. Mass.339.385
SMILESCOc1ccc(OC)c2CN3CCc4cc5OCOc5cc4[C@@H]3Cc12