Reaction Details
TargetD(2) dopamine receptor
LigandBDBM50429044
Substrate/Competitorn/a
Meas. Tech.Reception Binding Assay
Temperature303.15±n/a K
Ki 32.16±n/a nM
IC50 91.11±n/a nM
Commentsextracted
Citation Liu, HXie, XZhen, XSun, HLi, JZhu, LLi, ZChen, YJiang, HChen, K Hexahydrodibenzo[a,g]quinolizine compound, preparation method thereof, pharmaceutical composition and use thereof US Patent US9359372 Publication Date 6/7/2016
 
D(2) dopamine receptor
Name:D(2) dopamine receptor
Type:Cell-surface receptors
Mol. Mass.:50647.10
Organism:Homo sapiens (Human)
Description:P14416
Residue:443
BDBM50429044
NameBDBM50429044
Synonyms:CHEMBL2334893 | US9359372, DC037029
TypeSmall organic molecule
Emp. Form.C19H19NO4
Mol. Mass.325.3585
SMILESCOc1cc2CCN3Cc4cc5OCOc5cc4C[C@H]3c2cc1O