Reaction Details
TargetD(2) dopamine receptor
LigandBDBM50387557
Substrate/Competitorn/a
Meas. Tech.Reception Binding Assay
Temperature303.15±n/a K
Ki 160.99±n/a nM
IC50 456.13±n/a nM
Commentsextracted
Citation Liu, HXie, XZhen, XSun, HLi, JZhu, LLi, ZChen, YJiang, HChen, K Hexahydrodibenzo[a,g]quinolizine compound, preparation method thereof, pharmaceutical composition and use thereof US Patent US9359372 Publication Date 6/7/2016
 
D(2) dopamine receptor
Name:D(2) dopamine receptor
Type:Cell-surface receptors
Mol. Mass.:50647.10
Organism:Homo sapiens (Human)
Description:P14416
Residue:443
BDBM50387557
NameBDBM50387557
Synonyms:CHEMBL2057457 | US9359372, DC037031
TypeSmall organic molecule
Emp. Form.C20H23NO2
Mol. Mass.309.4021
SMILESCOc1cc2CCN3Cc4c(C)cc(C)cc4C[C@H]3c2cc1O