Reaction Details
TargetD(2) dopamine receptor
LigandBDBM235768
Substrate/Competitorn/a
Meas. Tech.Affinity Assay
Temperature310.15±n/a K
EC50 3300±n/a nM
Commentsextracted
Citation Liu, HXie, XZhen, XSun, HLi, JZhu, LLi, ZChen, YJiang, HChen, K Hexahydrodibenzo[a,g]quinolizine compound, preparation method thereof, pharmaceutical composition and use thereof US Patent US9359372 Publication Date 6/7/2016
 
D(2) dopamine receptor
Name:D(2) dopamine receptor
Type:Cell-surface receptors
Mol. Mass.:50647.10
Organism:Homo sapiens (Human)
Description:P14416
Residue:443
BDBM235768
NameBDBM235768
Synonyms:US9359372, DC037003
TypeSmall organic molecule
Emp. Form.C21H25NO4
Mol. Mass.355.4275
SMILESCOc1ccc(OC)c2CN3CCc4cc(OC)c(OC)cc4C3Cc12