Reaction Details
TargetD(2) dopamine receptor
LigandBDBM235774
Substrate/Competitorn/a
Meas. Tech.Affinity Assay
Temperature310.15±n/a K
EC50 591±n/a nM
Commentsextracted
Citation Liu, HXie, XZhen, XSun, HLi, JZhu, LLi, ZChen, YJiang, HChen, K Hexahydrodibenzo[a,g]quinolizine compound, preparation method thereof, pharmaceutical composition and use thereof US Patent US9359372 Publication Date 6/7/2016
 
D(2) dopamine receptor
Name:D(2) dopamine receptor
Type:Cell-surface receptors
Mol. Mass.:50647.10
Organism:Homo sapiens (Human)
Description:P14416
Residue:443
BDBM235774
NameBDBM235774
Synonyms:US9359372, DC037024
TypeSmall organic molecule
Emp. Form.C19H21NO4
Mol. Mass.327.3743
SMILESCOc1cc2CC3N(CCc4cc(O)c(O)cc34)Cc2cc1OC