Reaction Details
Target5-hydroxytryptamine receptor 1A
LigandBDBM50387556
Substrate/Competitorn/a
Meas. Tech.Reception Binding Assay
Temperature303.15±n/a K
Ki 599.89±n/a nM
IC50 758.03±n/a nM
Commentsextracted
Citation Liu, HXie, XZhen, XSun, HLi, JZhu, LLi, ZChen, YJiang, HChen, K Hexahydrodibenzo[a,g]quinolizine compound, preparation method thereof, pharmaceutical composition and use thereof US Patent US9359372 Publication Date 6/7/2016
 
5-hydroxytryptamine receptor 1A
Name:5-hydroxytryptamine receptor 1A
Type:n/a
Mol. Mass.:46122.49
Organism:Homo sapiens (Human)
Description:n/a
Residue:422
BDBM50387556
NameBDBM50387556
Synonyms:CHEMBL2057438 | US9359372, DC037077
TypeSmall organic molecule
Emp. Form.C21H23NO5
Mol. Mass.369.411
SMILESCOc1cc(OC)c2CN3CCc4cc5OCOc5cc4[C@@H]3Cc2c1CO