Reaction Details
TargetD(1A) dopamine receptor
LigandBDBM235767
Substrate/Competitorn/a
Meas. Tech.Radioligand Binding Assay
pH7.4±n/a
Temperature303.15±n/a K
Ki 74.51±3.85 nM
Commentsextracted
Citation Liu, HXie, XZhen, XSun, HLi, JZhu, LLi, ZChen, YJiang, HChen, K Hexahydrodibenzo[a,g]quinolizine compound, preparation method thereof, pharmaceutical composition and use thereof US Patent US9359372 Publication Date 6/7/2016
 
D(1A) dopamine receptor
Name:D(1A) dopamine receptor
Type:Enzyme
Mol. Mass.:49303.43
Organism:Homo sapiens (Human)
Description:P21728
Residue:446
BDBM235767
NameBDBM235767
Synonyms:US9359372, DC037076
TypeSmall organic molecule
Emp. Form.C22H27NO5
Mol. Mass.385.4535
SMILESCOc1cc2CCN3Cc4c(OC)cc(OC)c(OC)c4CC3c2cc1OC