Reaction Details
TargetD(1A) dopamine receptor
LigandBDBM50429046
Substrate/Competitorn/a
Meas. Tech.Radioligand Binding Assay
pH7.4±n/a
Temperature303.15±n/a K
Ki 17.29±0.54 nM
Commentsextracted
Citation Liu, HXie, XZhen, XSun, HLi, JZhu, LLi, ZChen, YJiang, HChen, K Hexahydrodibenzo[a,g]quinolizine compound, preparation method thereof, pharmaceutical composition and use thereof US Patent US9359372 Publication Date 6/7/2016
 
D(1A) dopamine receptor
Name:D(1A) dopamine receptor
Type:Enzyme
Mol. Mass.:49303.43
Organism:Homo sapiens (Human)
Description:P21728
Residue:446
BDBM50429046
NameBDBM50429046
Synonyms:CHEMBL2334882 | US9359372, DC037081
TypeSmall organic molecule
Emp. Form.C20H21NO3
Mol. Mass.323.3856
SMILESCOc1c(O)ccc2C[C@@H]3N(CCc4cc5CCOc5cc34)Cc12