Reaction Details
TargetD(1A) dopamine receptor
LigandBDBM50387561
Substrate/Competitorn/a
Meas. Tech.[35S]GTPγS Binding Assay
pH7.5±n/a
IC50 1400±200 nM
Commentsextracted
Citation Liu, HXie, XZhen, XSun, HLi, JZhu, LLi, ZChen, YJiang, HChen, K Hexahydrodibenzo[a,g]quinolizine compound, preparation method thereof, pharmaceutical composition and use thereof US Patent US9359372 Publication Date 6/7/2016
 
D(1A) dopamine receptor
Name:D(1A) dopamine receptor
Type:Enzyme
Mol. Mass.:49303.43
Organism:Homo sapiens (Human)
Description:P21728
Residue:446
BDBM50387561
NameBDBM50387561
Synonyms:CHEMBL2057455 | US9359372, DC037079
TypeSmall organic molecule
Emp. Form.C20H23NO4
Mol. Mass.341.4009
SMILESCOc1cc2C[C@@H]3N(CCc4cc(OC)c(O)cc34)Cc2c(OC)c1