Reaction Details
TargetD(1A) dopamine receptor
LigandBDBM86180
Substrate/Competitorn/a
Meas. Tech.[35S]GTPγS Binding Assay
pH7.5±n/a
IC50 740±50 nM
Commentsextracted
Citation Liu, HXie, XZhen, XSun, HLi, JZhu, LLi, ZChen, YJiang, HChen, K Hexahydrodibenzo[a,g]quinolizine compound, preparation method thereof, pharmaceutical composition and use thereof US Patent US9359372 Publication Date 6/7/2016
 
D(1A) dopamine receptor
Name:D(1A) dopamine receptor
Type:Enzyme
Mol. Mass.:49303.43
Organism:Homo sapiens (Human)
Description:P21728
Residue:446
BDBM86180
NameBDBM86180
Synonyms:CAS_87075-17-0 SCH 23390 US9359372, SCH23390
TypeSmall organic molecule
Emp. Form.C17H18ClNO
Mol. Mass.287.784
SMILESCN1CCc2cc(Cl)c(O)cc2C(C1)c1ccccc1