Reaction Details
TargetKappa-type opioid receptor
LigandBDBM235792
Substrate/Competitorn/a
Meas. Tech.Time Resolved Fluorescence Resonance Energy Transfer (TR-FRET)-Based cAMP Immunoassay
Temperature298.15±n/a K
EC50 0.0234±n/a nM
Commentsextracted
Citation Schteingart, CDMenzaghi, FJiang, GAlexander, RVSueiras-Diaz, JSpencer, RHChalmers, DTLuo, RZ Synthetic peptide amides US Patent US9359399 Publication Date 6/7/2016
 
Kappa-type opioid receptor
Name:Kappa-type opioid receptor
Type:Enzyme
Mol. Mass.:42656.78
Organism:Mus musculus (Mouse)
Description:P33534
Residue:380
BDBM235792
NameBDBM235792
Synonyms:US9359399, 36
TypeSmall organic molecule
Emp. Form.C42H56N8O5
Mol. Mass.752.9446
SMILESCC(C)C[C@@H](NC(=O)[C@@H](Cc1ccccc1)NC(=O)[C@H](N)Cc1ccccc1)C(=O)N[C@H](CCCCN)C(=O)N1CCC(CC1)n1c2ccccc2[nH]c1=O