Reaction Details
TargetKappa-type opioid receptor
LigandBDBM235812
Substrate/Competitorn/a
Meas. Tech.Time Resolved Fluorescence Resonance Energy Transfer (TR-FRET)-Based cAMP Immunoassay
Temperature298.15±n/a K
EC50 0.0083±n/a nM
Commentsextracted
Citation Schteingart, CDMenzaghi, FJiang, GAlexander, RVSueiras-Diaz, JSpencer, RHChalmers, DTLuo, RZ Synthetic peptide amides US Patent US9359399 Publication Date 6/7/2016
 
Kappa-type opioid receptor
Name:Kappa-type opioid receptor
Type:G Protein-Coupled Receptor (GPCR)
Mol. Mass.:42648.76
Organism:Homo sapiens (Human)
Description:P41145
Residue:380
BDBM235812
NameBDBM235812
Synonyms:US9359399, 26
TypeSmall organic molecule
Emp. Form.C39H57N7O5
Mol. Mass.703.9138
SMILESCC(C)C[C@@H](NC(=O)[C@@H](Cc1ccccc1)NC(=O)[C@H](N)Cc1ccccc1)C(=O)N[C@H](CCCCN)C(=O)N1CCC2(CCN(C)C2=O)CC1