Reaction Details
TargetVascular endothelial growth factor receptor 2
LigandBDBM47165
Substrate/Competitorn/a
Meas. Tech.Kinase Inhibition Assay
IC50 920±n/a nM
Citation Dannhardt, GPlutizki, SKramb, JMüller, AMöhler, M 3-(indolyl)- or 3-(azaindolyl)- 4-arylmaleimide derivatives for use in the treatment of colon and gastric adenocarcinoma US Patent US9364459 Publication Date 6/14/2016
 
Vascular endothelial growth factor receptor 2
Name:Vascular endothelial growth factor receptor 2
Type:Receptor Tyrosine Kinase
Mol. Mass.:151510.97
Organism:Homo sapiens (Human)
Description:P35968
Residue:1356
BDBM47165
NameBDBM47165
Synonyms:US8957103, C1 | US9364459, I
Typen/a
Emp. Form.C24H24N2O6
Mol. Mass.436.4572
SMILESCOc1cc(cc(OC)c1OC)C1=C(C(=O)NC1=O)c1cn(CCCO)c2ccccc12