Reaction Details
TargetVascular endothelial growth factor receptor 2
LigandBDBM235826
Substrate/Competitorn/a
Meas. Tech.Kinase Inhibition Assay
IC50 2827±n/a nM
Citation Dannhardt, GPlutizki, SKramb, JMüller, AMöhler, M 3-(indolyl)- or 3-(azaindolyl)- 4-arylmaleimide derivatives for use in the treatment of colon and gastric adenocarcinoma US Patent US9364459 Publication Date 6/14/2016
 
Vascular endothelial growth factor receptor 2
Name:Vascular endothelial growth factor receptor 2
Type:Receptor Tyrosine Kinase
Mol. Mass.:151510.97
Organism:Homo sapiens (Human)
Description:P35968
Residue:1356
BDBM235826
NameBDBM235826
Synonyms:US9364459, N
TypeSmall organic molecule
Emp. Form.C29H36N4O5
Mol. Mass.520.6188
SMILESCOc1cc(cc(OC)c1OC)C1=C(C(=O)NC1=O)c1cn(CCC[NH+]2CC[NH+](C)CC2)c2ccccc12