Reaction Details
TargetReceptor-type tyrosine-protein kinase FLT3
LigandBDBM50399334
Substrate/Competitorn/a
Meas. Tech.Kinase Inhibition Assay
IC50 132±n/a nM
Citation Dannhardt, GPlutizki, SKramb, JMüller, AMöhler, M 3-(indolyl)- or 3-(azaindolyl)- 4-arylmaleimide derivatives for use in the treatment of colon and gastric adenocarcinoma US Patent US9364459 Publication Date 6/14/2016
 
Receptor-type tyrosine-protein kinase FLT3
Name:Receptor-type tyrosine-protein kinase FLT3
Type:Enzyme
Mol. Mass.:112888.62
Organism:Homo sapiens (Human)
Description:P36888
Residue:993
BDBM50399334
NameBDBM50399334
Synonyms:CHEMBL2180878 | US9364459, B
TypeSmall organic molecule
Emp. Form.C20H17N3O5
Mol. Mass.379.3661
SMILESCOc1cc(cc(OC)c1OC)C1=C(C(=O)NC1=O)c1c[nH]c2ncccc12