Reaction Details
TargetReceptor-type tyrosine-protein kinase FLT3
LigandBDBM235825
Substrate/Competitorn/a
Meas. Tech.Kinase Inhibition Assay
IC50>10000±n/a nM
Citation Dannhardt, GPlutizki, SKramb, JMüller, AMöhler, M 3-(indolyl)- or 3-(azaindolyl)- 4-arylmaleimide derivatives for use in the treatment of colon and gastric adenocarcinoma US Patent US9364459 Publication Date 6/14/2016
 
Receptor-type tyrosine-protein kinase FLT3
Name:Receptor-type tyrosine-protein kinase FLT3
Type:Enzyme
Mol. Mass.:112888.62
Organism:Homo sapiens (Human)
Description:P36888
Residue:993
BDBM235825
NameBDBM235825
Synonyms:US9364459, M
TypeSmall organic molecule
Emp. Form.C27H29N3O6
Mol. Mass.491.5357
SMILESCOc1cc(cc(OC)c1OC)C1=C(C(=O)NC1=O)c1cn(CCN2CCOCC2)c2ccccc12