Reaction Details
TargetIsoform PDE10A2 of cAMP and cAMP-inhibited cGMP 3',5'-cyclic phosphodiesterase 10A (PDE10A2)
LigandBDBM236019
Substrate/Competitorn/a
Meas. Tech.Fluorescence Polarization Assay
pH7.2±n/a
Temperature298.15±n/a K
Ki 0.065±n/a nM
Commentsextracted
Citation Cox, CDBeshore, DCKim, JJKuduk, SDMcVean, CAReger, TSheen, JT 1,3 substituted azetidine PDE10 inhibitors US Patent US9365562 Publication Date 6/14/2016
 
Isoform PDE10A2 of cAMP and cAMP-inhibited cGMP 3',5'-cyclic phosphodiesterase 10A (PDE10A2)
Name:Isoform PDE10A2 of cAMP and cAMP-inhibited cGMP 3',5'-cyclic phosphodiesterase 10A (PDE10A2)
Type:Enzyme
Mol. Mass.:89387.03
Organism:Homo sapiens (Human)
Description:Q9Y233-2
Residue:789
BDBM236019
NameBDBM236019
Synonyms:US9365562, 57
TypeSmall organic molecule
Emp. Form.C26H24F2N8
Mol. Mass.486.5192
SMILESCc1nc(Cc2cc(F)ccc2F)n(n1)-c1cc(nc(C)n1)N1CC(C1)c1nc2ccccc2n1C