Reaction Details
TargetTyrosine-protein kinase ABL1
LigandBDBM236557
Substrate/Competitorn/a
Meas. Tech.Mobility Shift Assay
pH7.5±n/a
Temperature301.15±n/a K
IC50>10000±n/a nM
Commentsextracted
Citation Wu, FShu, C PI3K and/or mTOR inhibitor US Patent US9365572 Publication Date 6/14/2016
 
Tyrosine-protein kinase ABL1
Name:Tyrosine-protein kinase ABL1
Type:Enzyme
Mol. Mass.:122897.30
Organism:Homo sapiens (Human)
Description:P00519
Residue:1130
BDBM236557
NameBDBM236557
Synonyms:US9365572, 5
TypeSmall organic molecule
Emp. Form.C22H13F3N6O2
Mol. Mass.450.3728
SMILESNc1ccc(cn1)-c1ccc2ncc3c(n(-c4cccc(c4)C(F)(F)F)c(=O)[nH]c3=O)c2n1