Reaction Details
TargetDual specificity protein kinase TTK
LigandBDBM236663
Substrate/Competitorn/a
Meas. Tech.Kinase Assay
pH7.7±n/a
Temperature295.15±n/a K
IC50 0.7±n/a nM
Commentsextracted
Citation Klar, UKoppitz, MNguyen, DKosemund, DNeuhaus, RSiemeister, G Substituted benzimidazoles US Patent US9388140 Publication Date 7/12/2016
 
Dual specificity protein kinase TTK
Name:Dual specificity protein kinase TTK
Type:Protein
Mol. Mass.:97086.79
Organism:Homo sapiens (Human)
Description:P33981
Residue:857
BDBM236663
NameBDBM236663
Synonyms:US9388140, 4
TypeSmall organic molecule
Emp. Form.C27H24F4N4O2
Mol. Mass.512.4987
SMILESCc1cc(ccc1C(=O)NC1CC1)-n1cnc2c(NCCC(F)(F)F)cc(Oc3cccc(F)c3)cc12