Reaction Details
TargetDual specificity protein kinase TTK
LigandBDBM236735
Substrate/Competitorn/a
Meas. Tech.Kinase Assay
pH7.7±n/a
Temperature295.15±n/a K
IC50 1±n/a nM
Commentsextracted
Citation Klar, UKoppitz, MNguyen, DKosemund, DNeuhaus, RSiemeister, G Substituted benzimidazoles US Patent US9388140 Publication Date 7/12/2016
 
Dual specificity protein kinase TTK
Name:Dual specificity protein kinase TTK
Type:Protein
Mol. Mass.:97086.79
Organism:Homo sapiens (Human)
Description:P33981
Residue:857
BDBM236735
NameBDBM236735
Synonyms:US9388140, 77
TypeSmall organic molecule
Emp. Form.C28H24F3N5O2
Mol. Mass.519.5177
SMILESCc1cc(ccc1C(=O)NC1CC1)-n1cnc2c(NCCC(F)(F)F)cc(Oc3cccc(c3)C#N)cc12