Reaction Details
TargetRibosomal protein S6 kinase alpha-1
LigandBDBM236877
Substrate/Competitorn/a
Meas. Tech.Phosphorylation Assay
Temperature310.15±n/a K
IC50 16.3±n/a nM
Commentsextracted
Citation Blake, JChen, HChicarelli, MGaudino, JGazzard, LKintz, SMohr, PRobarge, KSchwarz, JZhou, A Serine/threonine kinase inhibitors US Patent US9388171 Publication Date 7/12/2016
 
Ribosomal protein S6 kinase alpha-1
Name:Ribosomal protein S6 kinase alpha-1
Type:Serine/threonine-protein kinase
Mol. Mass.:82736.10
Organism:Homo sapiens (Human)
Description:n/a
Residue:735
BDBM236877
NameBDBM236877
Synonyms:US9388171, I-5
TypeSmall organic molecule
Emp. Form.C22H22ClFN4O3
Mol. Mass.444.886
SMILESOC[C@@H](NC(=O)c1ccc2cnc(NC3CCOCC3)cc2n1)c1ccc(Cl)c(F)c1