Reaction Details
TargetVascular endothelial growth factor receptor 2
LigandBDBM139546
Substrate/Competitorn/a
Meas. Tech.VEGFR2 Kinase Assay
pH7.4±n/a
Temperature303.15±n/a K
IC50 783±n/a nM
Commentsextracted
Citation Hull, III, CEMalone, TC Method of treating conditiions with kinase inhibitors US Patent US9388176 Publication Date 7/12/2016
 
Vascular endothelial growth factor receptor 2
Name:Vascular endothelial growth factor receptor 2
Type:Receptor Tyrosine Kinase
Mol. Mass.:151510.97
Organism:Homo sapiens (Human)
Description:P35968
Residue:1356
BDBM139546
NameBDBM139546
Synonyms:US8889870, 6 US9820989, 6
TypeSmall organic molecule
Emp. Form.C21H21N5O
Mol. Mass.359.4243
SMILESCc1ccc(NC(=O)c2cccc(c2)N2CCc3nc(N)ncc3C2)cc1