Reaction Details
TargetPlatelet-derived growth factor receptor beta
LigandBDBM139615
Substrate/Competitorn/a
Meas. Tech.PDGFRβ Kinase Assay
pH7.4±n/a
Temperature303.15±n/a K
IC50 1560±n/a nM
Commentsextracted
Citation Hull, III, CEMalone, TC Method of treating conditiions with kinase inhibitors US Patent US9388176 Publication Date 7/12/2016
 
Platelet-derived growth factor receptor beta
Name:Platelet-derived growth factor receptor beta
Type:Enzyme
Mol. Mass.:123922.25
Organism:Homo sapiens (Human)
Description:P09619
Residue:1106
BDBM139615
NameBDBM139615
Synonyms:US8889870, 163 US9820989, 163
TypeSmall organic molecule
Emp. Form.C22H22N4O
Mol. Mass.358.4363
SMILESCc1cccc(NC(=O)Nc2ccc(cc2)N2CCc3ccncc3C2)c1