Reaction Details
TargetPhosphatidylinositol 4,5-bisphosphate 3-kinase catalytic subunit delta isoform
LigandBDBM236968
Substrate/Competitorn/a
Meas. Tech.HTRF Assay
IC50 0.2±n/a nM
Citation Erra Sola, MCarrascal Riera, MTaltavull Moll, JCaturla Javaloyes, JFBernal Anchuela, FJPages Santacana, LMMir Cepeda, MCasals Coll, GHernandez Olasagarre, MB Pyrrolotriazinone derivatives as PI3K inhibitors US Patent US9388189 Publication Date 7/12/2016
 
Phosphatidylinositol 4,5-bisphosphate 3-kinase catalytic subunit delta isoform
Name:Phosphatidylinositol 4,5-bisphosphate 3-kinase catalytic subunit delta isoform
Type:Enzyme Subunit
Mol. Mass.:119489.41
Organism:Homo sapiens (Human)
Description:O00329
Residue:1044
BDBM236968
NameBDBM236968
Synonyms:US9388189, 140
TypeSmall organic molecule
Emp. Form.C27H27N9O2
Mol. Mass.509.5624
SMILESC[C@H](Nc1ncnc2[nH]cc(-c3cnn(CCCO)c3)c12)c1nn2ccc(C)c2c(=O)n1-c1ccccc1