Reaction Details
TargetApoptosis regulator Bcl-2
LigandBDBM237169
Substrate/Competitorn/a
Meas. Tech.Time Resolved-Fluorescence Resonance Energy Transfer (TR-FRET) Assay
Temperature298.15±n/a K
Ki<0.010±n/a nM
Commentsextracted
Citation Tao, ZWang, XSouers, AJCatron, NDSullivan, GM Apoptosis-inducing agents for the treatment of cancer and immune and autoimmune diseases US Patent US9403822 Publication Date 8/2/2016
 
Apoptosis regulator Bcl-2
Name:Apoptosis regulator Bcl-2
Type:Homodimer or heterodimer
Mol. Mass.:26269.11
Organism:Homo sapiens (Human)
Description:P10415
Residue:239
BDBM237169
NameBDBM237169
Synonyms:US9403822, 2
TypeSmall organic molecule
Emp. Form.C46H53ClN7O11PS
Mol. Mass.978.445
SMILESCC1(C)CCC(CN2CCN(CC2)c2ccc(C(=O)NS(=O)(=O)c3ccc(NCC4CCOCC4)c(c3)[N+]([O-])=O)c(Oc3cn(COP(O)(O)=O)c4nccc4c3)c2)=C(C1)c1ccc(Cl)cc1