Reaction Details
TargetCarbonic anhydrase 1
LigandBDBM237284
Substrate/Competitorn/a
Meas. Tech.CA Activity Assay
pH7.4±n/a
Ki 21720±n/a nM
Commentsextracted
Citation Ekinci, DKurbanoglu, NISalamci, ESentürk, MSupuran, CT Carbonic anhydrase inhibitors: inhibition of human and bovine isoenzymes by benzenesulphonamides, cyclitols and phenolic compounds. J Enzyme Inhib Med Chem27:845-8 (2012) 
 
Carbonic anhydrase 1
Name:Carbonic anhydrase 1
Type:Enzyme
Mol. Mass.:28873.37
Organism:Homo sapiens (Human)
Description:P00915
Residue:261
BDBM237284
NameBDBM237284
Synonyms:Carbonic anhydrase inhibitors (CAIs), 7
TypeSmall organic molecule
Emp. Form.C6H12O2
Mol. Mass.116.1583
SMILESO[C@H]1CCCC[C@H]1O