Reaction Details
TargetCarbonic anhydrase 2
LigandBDBM50428400
Substrate/Competitorn/a
Meas. Tech.CA Activity Assay
pH7.4±n/a
Ki 14340±n/a nM
Commentsextracted
Citation Ekinci, DKurbanoglu, NISalamci, ESentürk, MSupuran, CT Carbonic anhydrase inhibitors: inhibition of human and bovine isoenzymes by benzenesulphonamides, cyclitols and phenolic compounds. J Enzyme Inhib Med Chem27:845-8 (2012) 
 
Carbonic anhydrase 2
Name:Carbonic anhydrase 2
Type:Enzyme
Mol. Mass.:29250.71
Organism:Homo sapiens (Human)
Description:P00918
Residue:260
BDBM50428400
NameBDBM50428400
Synonyms:CA inhibitor, 2 [(4-Methylphenyl)Sulfonyl]Phenylamine
TypeSmall organic molecule
Emp. Form.C13H13NO2S
Mol. Mass.247.313
SMILESCc1ccc(cc1)S(=O)(=O)Nc1ccccc1