Reaction Details
TargetCarbonic anhydrase 2
LigandBDBM60967
Substrate/Competitorn/a
Meas. Tech.CA Activity Assay
pH7.4±n/a
Ki 470±n/a nM
Commentsextracted
Citation Ekinci, DKurbanoglu, NISalamci, ESentürk, MSupuran, CT Carbonic anhydrase inhibitors: inhibition of human and bovine isoenzymes by benzenesulphonamides, cyclitols and phenolic compounds. J Enzyme Inhib Med Chem27:845-8 (2012) 
 
Carbonic anhydrase 2
Name:Carbonic anhydrase 2
Type:Enzyme
Mol. Mass.:29250.71
Organism:Homo sapiens (Human)
Description:P00918
Residue:260
BDBM60967
NameBDBM60967
Synonyms:Carbonic anhydrase inhibitors (CAIs), 5
Typen/a
Emp. Form.C13H19NO5S
Mol. Mass.301.359
SMILESCc1ccc(cc1)S(=O)(=O)N[C@H]1[C@@H](O)CC[C@H](O)[C@@H]1O