Reaction Details
TargetCarbonic anhydrase 2
LigandBDBM237284
Substrate/Competitorn/a
Meas. Tech.CA Activity Assay
pH7.4±n/a
Ki 1840±n/a nM
Commentsextracted
Citation Ekinci, DKurbanoglu, NISalamci, ESentürk, MSupuran, CT Carbonic anhydrase inhibitors: inhibition of human and bovine isoenzymes by benzenesulphonamides, cyclitols and phenolic compounds. J Enzyme Inhib Med Chem27:845-8 (2012) 
 
Carbonic anhydrase 2
Name:Carbonic anhydrase 2
Type:Enzyme
Mol. Mass.:29250.71
Organism:Homo sapiens (Human)
Description:P00918
Residue:260
BDBM237284
NameBDBM237284
Synonyms:Carbonic anhydrase inhibitors (CAIs), 7
TypeSmall organic molecule
Emp. Form.C6H12O2
Mol. Mass.116.1583
SMILESO[C@H]1CCCC[C@H]1O