Reaction Details
TargetCarbonic anhydrase 6
LigandBDBM237283
Substrate/Competitorn/a
Meas. Tech.CA Activity Assay
pH7.4±n/a
Ki 275300±n/a nM
Commentsextracted
Citation Ekinci, DKurbanoglu, NISalamci, ESentürk, MSupuran, CT Carbonic anhydrase inhibitors: inhibition of human and bovine isoenzymes by benzenesulphonamides, cyclitols and phenolic compounds. J Enzyme Inhib Med Chem27:845-8 (2012) 
 
Carbonic anhydrase 6
Name:Carbonic anhydrase 6
Type:Enzyme
Mol. Mass.:35371.40
Organism:Homo sapiens (Human)
Description:P23280
Residue:308
BDBM237283
NameBDBM237283
Synonyms:Carbonic anhydrase inhibitors (CAIs), 4
TypeSmall organic molecule
Emp. Form.C16H21NO3S
Mol. Mass.307.408
SMILESCc1ccc(cc1)S(=O)(=O)N1[C@@H]2C=CCC[C@@H]2OC1(C)C