Reaction Details
TargetCarbonic anhydrase 2
LigandBDBM237291
Substrate/Competitorn/a
Meas. Tech.CA Inhibition Assay
pH7.5±n/a
Temperature298.15±n/a K
Ki 105±n/a nM
Commentsextracted
Citation Özdemir, ZÿSentürk, MEkinci, D Inhibition of mammalian carbonic anhydrase isoforms I, II and VI with thiamine and thiamine-like molecules. J Enzyme Inhib Med Chem28:316-9 (2013) 
 
Carbonic anhydrase 2
Name:Carbonic anhydrase 2
Type:Enzyme
Mol. Mass.:29250.71
Organism:Homo sapiens (Human)
Description:P00918
Residue:260
BDBM237291
NameBDBM237291
Synonyms:CA inhibitor, 2
TypeSmall organic molecule
Emp. Form.C13H16NOS
Mol. Mass.234.337
SMILESCc1c(CCO)sc[n+]1Cc1ccccc1