Reaction Details
TargetCarbonic anhydrase 1
LigandBDBM26190
Substrate/Competitor4-Nitrophenyl acetate (NPA)
Meas. Tech.Esterase Activity Assay
Ki 1.08e+4±n/a nM
Citation Kazancioglu, EAGüney, MSentürk, MSupuran, CT Simple methanesulfonates are hydrolyzed by the sulfatase carbonic anhydrase activity. J Enzyme Inhib Med Chem27:880-5 (2012) 
 
Carbonic anhydrase 1
Name:Carbonic anhydrase 1
Type:Enzyme
Mol. Mass.:28873.37
Organism:Homo sapiens (Human)
Description:P00915
Residue:261
BDBM26190
4-Nitrophenyl acetate (NPA)
NameBDBM26190
Synonyms:1,4-Dihydroxybenzene, XIII CHEMBL537 Hydroquinone, HQ phenol derivative, 4
TypeSmall organic molecule
Emp. Form.C6H6O2
Mol. Mass.110.1106
SMILESOc1ccc(O)cc1