Reaction Details
TargetCarbonic anhydrase 2
LigandBDBM237294
Substrate/Competitor4-Nitrophenyl acetate (NPA)
Meas. Tech.Esterase Activity Assay
Ki 4.23e+3±n/a nM
Citation Kazancioglu, EAGüney, MSentürk, MSupuran, CT Simple methanesulfonates are hydrolyzed by the sulfatase carbonic anhydrase activity. J Enzyme Inhib Med Chem27:880-5 (2012) 
 
Carbonic anhydrase 2
Name:Carbonic anhydrase 2
Type:Enzyme
Mol. Mass.:29250.71
Organism:Homo sapiens (Human)
Description:P00918
Residue:260
BDBM237294
4-Nitrophenyl acetate (NPA)
NameBDBM237294
Synonyms:1,4-Phenylene dimethanesulfonate (6)
TypeSmall organic molecule
Emp. Form.C8H10O6S2
Mol. Mass.266.291
SMILESCS(=O)(=O)Oc1ccc(OS(C)(=O)=O)cc1