Reaction Details
TargetCarbonic anhydrase 2
LigandBDBM50031472
Substrate/Competitor4-Nitrophenyl acetate (NPA)
Meas. Tech.Esterase Activity Assay
Ki 5.2e+2±n/a nM
Citation Kazancioglu, EAGüney, MSentürk, MSupuran, CT Simple methanesulfonates are hydrolyzed by the sulfatase carbonic anhydrase activity. J Enzyme Inhib Med Chem27:880-5 (2012) 
 
Carbonic anhydrase 2
Name:Carbonic anhydrase 2
Type:Enzyme
Mol. Mass.:29250.71
Organism:Homo sapiens (Human)
Description:P00918
Residue:260
BDBM50031472
4-Nitrophenyl acetate (NPA)
NameBDBM50031472
Synonyms:1,2,3-Trihydroxybenzene, XIV Pyrogallol (10) pyrogallol
TypeSmall organic molecule
Emp. Form.C6H6O3
Mol. Mass.126.11
SMILESOc1cccc(O)c1O