Reaction Details
TargetCarbonic anhydrase 6
LigandBDBM10888
Substrate/Competitor4-Nitrophenyl acetate (NPA)
Meas. Tech.Esterase Activity Assay
Ki 2.42e+3±n/a nM
Citation Kazancioglu, EAGüney, MSentürk, MSupuran, CT Simple methanesulfonates are hydrolyzed by the sulfatase carbonic anhydrase activity. J Enzyme Inhib Med Chem27:880-5 (2012) 
 
Carbonic anhydrase 6
Name:Carbonic anhydrase 6
Type:Enzyme
Mol. Mass.:35371.40
Organism:Homo sapiens (Human)
Description:P23280
Residue:308
BDBM10888
4-Nitrophenyl acetate (NPA)
NameBDBM10888
Synonyms:1,2-benzoxazol-3-ylmethanesulfonamide SPR_2 Zonisamide Zonisamide (ZNS) Zonisamide, ZNS
TypeSmall organic molecule
Emp. Form.C8H8N2O3S
Mol. Mass.212.226
SMILESNS(=O)(=O)Cc1noc2ccccc12