Reaction Details
TargetCarbonic anhydrase 2
LigandBDBM25901
Substrate/Competitorn/a
Meas. Tech.CA Inhibition Assay
pH7.5±n/a
Temperature298.15±n/a K
Ki 2.520e+6±n/a nM
Commentsextracted
Citation Liu, FMartin-Mingot, ALecornué, FJouannetaud, MPMaresca, AThibaudeau, SSupuran, CT Carbonic anhydrases inhibitory effects of new benzenesulfonamides synthesized by using superacid chemistry. J Enzyme Inhib Med Chem27:886-91 (2012) 
 
Carbonic anhydrase 2
Name:Carbonic anhydrase 2
Type:Enzyme
Mol. Mass.:29250.71
Organism:Homo sapiens (Human)
Description:P00918
Residue:260
BDBM25901
NameBDBM25901
Synonyms:4-chloro-N-(2-methyl-2,3-dihydro-1H-indol-1-yl)-3-sulfamoylbenzamide Indapamide Lozol | Noranat
TypeSmall organic molecule
Emp. Form.C16H16ClN3O3S
Mol. Mass.365.835
SMILESCC1Cc2ccccc2N1NC(=O)c1ccc(Cl)c(c1)S(N)(=O)=O