Reaction Details
TargetCarbonic anhydrase 2
LigandBDBM237336
Substrate/Competitorn/a
Meas. Tech.Carbonic Anhydrase I, II, IV and XII Assay
pH7.5±n/a
Temperature298.15±n/a K
IC50 215.8±0.0 nM
Commentsextracted
Citation Supuran, CTMaresca, AGregán, FRemko, M Three new aromatic sulfonamide inhibitors of carbonic anhydrases I, II, IV and XII. J Enzyme Inhib Med Chem28:289-93 (2013) 
 
Carbonic anhydrase 2
Name:Carbonic anhydrase 2
Type:Enzyme
Mol. Mass.:29250.71
Organism:Homo sapiens (Human)
Description:P00918
Residue:260
BDBM237336
NameBDBM237336
Synonyms:4-Sulfamoyl-N-(3-morpholinopropyl)benzamide (I-1)
TypeSmall organic molecule
Emp. Form.C14H21N3O4S
Mol. Mass.327.399
SMILESNS(=O)(=O)c1ccc(cc1)C(=O)NCCCN1CCOCC1