Reaction Details
TargetCarbonic anhydrase 12
LigandBDBM237336
Substrate/Competitorn/a
Meas. Tech.Carbonic Anhydrase I, II, IV and XII Assay
pH7.5±n/a
Temperature298.15±n/a K
IC50 645.2±0.0 nM
Commentsextracted
Citation Supuran, CTMaresca, AGregán, FRemko, M Three new aromatic sulfonamide inhibitors of carbonic anhydrases I, II, IV and XII. J Enzyme Inhib Med Chem28:289-93 (2013) 
 
Carbonic anhydrase 12
Name:Carbonic anhydrase 12
Type:Enzyme
Mol. Mass.:39456.00
Organism:Homo sapiens (Human)
Description:Catalytic domain of human cloned isozyme was used in the assay
Residue:354
BDBM237336
NameBDBM237336
Synonyms:4-Sulfamoyl-N-(3-morpholinopropyl)benzamide (I-1)
TypeSmall organic molecule
Emp. Form.C14H21N3O4S
Mol. Mass.327.399
SMILESNS(=O)(=O)c1ccc(cc1)C(=O)NCCCN1CCOCC1