Reaction Details
TargetBeta-2 adrenergic receptor
LigandBDBM238343
Substrate/Competitorn/a
Meas. Tech.cAMP Assay
Temperature310.15±n/a K
EC50 1±n/a nM
Commentsextracted
Citation Hughes, ADByun, DJacobsen, JR Diamide compounds having muscarinic receptor antagonist and BETA2 adrenergic receptor agonist activity US Patent US9394275 Publication Date 7/19/2016
 
Beta-2 adrenergic receptor
Name:Beta-2 adrenergic receptor
Type:n/a
Mol. Mass.:46461.69
Organism:Homo sapiens (Human)
Description:P07550
Residue:413
BDBM238343
NameBDBM238343
Synonyms:US9394275, I-67
TypeSmall organic molecule
Emp. Form.C51H56N6O6
Mol. Mass.849.0269
SMILESCC(Cc1ccc(CNC(=O)Cc2ccc(cc2)N(C)C(=O)CCN2CCC(CC2)OC(=O)Nc2ccccc2-c2ccccc2)cc1)NCCc1ccc(O)c2[nH]c(=O)ccc12