Reaction Details
TargetCytochrome P450 11B1, mitochondrial
LigandBDBM238149
Substrate/Competitorn/a
Meas. Tech.Cellular Inhibition Assay
Temperature310.15±n/a K
IC50 0.5±n/a nM
Commentsextracted
Citation Hartmann, RHille, UZimmer, CVock, CAHu, Q Selective CYP11B1 inhibitors for the treatment of cortisol dependent diseases US Patent US9394290 Publication Date 7/19/2016
 
Cytochrome P450 11B1, mitochondrial
Name:Cytochrome P450 11B1, mitochondrial
Type:Enzyme
Mol. Mass.:57591.44
Organism:Homo sapiens (Human)
Description:P15538
Residue:503
BDBM238149
NameBDBM238149
Synonyms:US9394290, ETO (etomidate)
TypeSmall organic molecule
Emp. Form.C14H16N2O2
Mol. Mass.244.289
SMILESCCOC(=O)c1cncn1C(C)c1ccccc1