Reaction Details
TargetCarbonic anhydrase 1
LigandBDBM238301
Substrate/Competitorn/a
Meas. Tech.CA Activity Assay
pH7.4±0
Temperature298.15±0 K
Ki 215±n/a nM
Citation Sen, EAlim, ZDuran, HIsgör, MMBeydemir, Å¿Kasimogullari, ROk, S Inhibitory effect of novel pyrazole carboxamide derivatives on human carbonic anhydrase enzyme. J Enzyme Inhib Med Chem28:328-36 (2013) 
 
Carbonic anhydrase 1
Name:Carbonic anhydrase 1
Type:Enzyme
Mol. Mass.:28873.37
Organism:Homo sapiens (Human)
Description:P00915
Residue:261
BDBM238301
NameBDBM238301
Synonyms:4-benzoyl-1-(3-nitrophenyl)-5-phenyl-N-(4-sulfamoylphenyl)-1H-pyrazole-3-carboxamide (2)
TypeSmall organic molecule
Emp. Form.C29H21N5O6S
Mol. Mass.567.572
SMILESNS(=O)(=O)c1ccc(NC(=O)c2nn(c(c2C(=O)c2ccccc2)-c2ccccc2)-c2cccc(c2)[N+]([O-])=O)cc1