Reaction Details
TargetCarbonic anhydrase 1
LigandBDBM238302
Substrate/Competitorn/a
Meas. Tech.CA Activity Assay
pH7.4±0
Temperature298.15±0 K
Ki 521±n/a nM
Citation Sen, EAlim, ZDuran, HIsgör, MMBeydemir, Å¿Kasimogullari, ROk, S Inhibitory effect of novel pyrazole carboxamide derivatives on human carbonic anhydrase enzyme. J Enzyme Inhib Med Chem28:328-36 (2013) 
 
Carbonic anhydrase 1
Name:Carbonic anhydrase 1
Type:Enzyme
Mol. Mass.:28873.37
Organism:Homo sapiens (Human)
Description:P00915
Residue:261
BDBM238302
NameBDBM238302
Synonyms:4-benzoyl-1-(3-((3-hydroxy-1-oxo-1-phenylbut-2-en-2-yl)diazenyl)phenyl)-5-phenyl-N-(4-sulfamoylphenyl)-1Hpyrazole-3-carboxamide (7)
TypeSmall organic molecule
Emp. Form.C39H30N6O6S
Mol. Mass.710.757
SMILESCC(=O)C(=N/Nc1cccc(c1)-n1nc(C(=O)Nc2ccc(cc2)S(N)(=O)=O)c(C(=O)c2ccccc2)c1-c1ccccc1)\C(=O)c1ccccc1