Reaction Details
TargetCarbonic anhydrase 2
LigandBDBM238299
Substrate/Competitorn/a
Meas. Tech.CA Activity Assay
pH7.4±0
Temperature298.15±0 K
Ki 64±n/a nM
Citation Sen, EAlim, ZDuran, HIsgör, MMBeydemir, Å¿Kasimogullari, ROk, S Inhibitory effect of novel pyrazole carboxamide derivatives on human carbonic anhydrase enzyme. J Enzyme Inhib Med Chem28:328-36 (2013) 
 
Carbonic anhydrase 2
Name:Carbonic anhydrase 2
Type:Enzyme
Mol. Mass.:29250.71
Organism:Homo sapiens (Human)
Description:P00918
Residue:260
BDBM238299
NameBDBM238299
Synonyms:1-(3-azidophenyl)-4-benzoyl-5-phenyl-N-(4-sulfamoylphenyl)-1H-pyrazole-3-carboxamide (9)
TypeSmall organic molecule
Emp. Form.C29H21N7O4S
Mol. Mass.563.587
SMILESNS(=O)(=O)c1ccc(NC(=O)c2nn(c(c2C(=O)c2ccccc2)-c2ccccc2)-c2cccc(c2)N=[N+]=[N-])cc1