Reaction Details
TargetLysine-specific demethylase 4C
LigandBDBM293686
Substrate/Competitorn/a
Meas. Tech.JMJD2C Assay
Temperature298.15±n/a K
IC50 550±n/a nM
Commentsextracted
Citation Boloor, AChen, YKWallace, MB Histone demethylase inhibitors US Patent US10106534 Publication Date 10/23/2018
 
Lysine-specific demethylase 4C
Name:Lysine-specific demethylase 4C
Type:Protein
Mol. Mass.:119979.01
Organism:Homo sapiens (Human)
Description:Q9H3R0
Residue:1056
BDBM293686
NameBDBM293686
Synonyms:3-({[7-(furan-3-yl)-3,4-dihydro-2H-1-benzopyran-4- | US10106534, Example 28
TypeSmall organic molecule
Emp. Form.C20H18N2O4
Mol. Mass.350.3679
SMILESOC(=O)c1ccncc1NCC1CCOc2cc(ccc12)-c1ccoc1