Reaction Details
TargetLysine-specific demethylase 4C
LigandBDBM293696
Substrate/Competitorn/a
Meas. Tech.JMJD2C Assay
Temperature298.15±n/a K
IC50 550±n/a nM
Commentsextracted
Citation Boloor, AChen, YKWallace, MB Histone demethylase inhibitors US Patent US10106534 Publication Date 10/23/2018
 
Lysine-specific demethylase 4C
Name:Lysine-specific demethylase 4C
Type:Protein
Mol. Mass.:119979.01
Organism:Homo sapiens (Human)
Description:Q9H3R0
Residue:1056
BDBM293696
NameBDBM293696
Synonyms:3-({[7-(3-methylbut-1-yn-1-yl)-3,4-dihydro-2H-1-benzopyran-4- | US10106534, Example 38
TypeSmall organic molecule
Emp. Form.C21H22N2O3
Mol. Mass.350.411
SMILESCC(C)C#Cc1ccc2C(CNc3cnccc3C(O)=O)CCOc2c1